1. xc
  2. ux

Ninja error loading 39buildninja39 the system cannot find the file specified esp32

By kl
jy
36 Gifts for People Who Have Everything
jn

Oct 25, 2019 · The text was updated successfully, but these errors were encountered:. Mar 14, 2019 · My name is Lee; an Independent Consultant, I'm here to help you with your problem. Open an elevated command prompt (search, cmd, right click and 'Run as administrator') Go to cd C:\Windows\System32\Recovery\ Rename the file ReAgent.xml: ren ReAgent.xml ReAgent.old Start Bitlocker Thanks ______________________________________________. class="algoSlug_icon" data-priority="2">Web. class="algoSlug_icon" data-priority="2">Web. Aug 29, 2018 · Building on Mac only works without headless.gn. The reason for that is that the headless windowing system (ozone's headless platform in particular) that we use on Linux/Win and is configured in headless.gn isn't yet supported on Mac.. class="algoSlug_icon" data-priority="2">Web.

A Papier colorblock notebook.
qc

nx

SQL Server Management Studio (SSMS) is an integrated environment. for managing any SQL infrastructure. Use SSMS to access, configure. manage administer, and develop all components of SQL Server. Azure SQL Database : Azure SQL Managed Instance SQL. Server on Azure VM, and Azure Synapse Analytics. I guess you have tried, some solutions : But give. Calling it now on Server 2012, the cluster service got my non standard privilege granted, but lost the privileges to load a driver and to shut down the system, that it has already had. A restart of the cluster service alone worked and - equipped with the new privileges - my cluster resource dll also worked. class="algoSlug_icon" data-priority="2">Web. Calling it now on Server 2012, the cluster service got my non standard privilege granted, but lost the privileges to load a driver and to shut down the system, that it has already had. A restart of the cluster service alone worked and - equipped with the new privileges - my cluster resource dll also worked. class="algoSlug_icon" data-priority="2">Web. . Aug 29, 2018 · Building on Mac only works without headless.gn. The reason for that is that the headless windowing system (ozone's headless platform in particular) that we use on Linux/Win and is configured in headless.gn isn't yet supported on Mac.. Nov 26, 2021 · The account runersystem is local system user and member of Administrator and Power users groups. Windows 10 to accept File Paths Over 260 Characters enabled HKEY_LOCAL_MACHINE\SYSTEM\CurrentControlSet\Control\FileSystem - LongPathsEnabled - 1. Windows Update performed. Antivirus Un-installed. Disk cleanup (Using Disk Cleanup) performed..

A person holds boxes covered with the Baggu reusable cloths.
bc

Nov 21, 2022 · Solutions to Fix the ErrorThe System Cannot find the File Specified are: First: Perform manual troubleshooting methods, or Second: Take the computer to an IT specialists The manual troubleshooting methods are described below: Method 1: Run Antivirus software The virus, cyber threats, and malicious attack are the common source of error.. > Executing task: ninja < ninja: error: loading 'build.ninja': The system cannot find the file specified. The terminal process "C:\WINDOWS\System32\WindowsPowerShell\v1.0\powershell.exe -Command ninja " terminated with exit code: 1. I have tested all the ways I can find to fix it but I'm not sure anything I missed or not. Ticket 1(Accesing a smartobject from endpoint assembly throws the following error): The customer resolved the issue internally. The .NET assmeblies were not present on the environment. Answering to my self and to whom is looking for answer the command to generate the ninja files is (dont miss the "args" : gn args out.gn\x64.debug. class="algoSlug_icon" data-priority="2">Web. </span> role="button" aria-expanded="false">. Oct 22, 2022 · What Causes The System Cannot Find the File Specified; How to Solve “The System Cannot Find the File SpecifiedError? Perform a SFC and DISM Scan; CHKDSK Scan; Update Windows; Microsoft Update Troubleshooter; Delete Software Distribution Folder ; Repair/Reinstall the Application ; Check System Log; Update Device Drivers; Turn Off Controlled Folder Access. 2. The second step is to wait for the scan to complete patiently. This might take a few minutes. If things go well, then you will receive a text that reads 'Windows Resource Protection did not find any integrity violations.' Then if you further get a message that reads 'Windows Resource Protection found corrupt files and repaired them,' it means that your corrupted or missing files.

Ticket 1(Accesing a smartobject from endpoint assembly throws the following error): The customer resolved the issue internally. The .NET assmeblies were not present on the environment. Nov 26, 2021 · The account runersystem is local system user and member of Administrator and Power users groups. Windows 10 to accept File Paths Over 260 Characters enabled HKEY_LOCAL_MACHINE\SYSTEM\CurrentControlSet\Control\FileSystem - LongPathsEnabled - 1. Windows Update performed. Antivirus Un-installed. Disk cleanup (Using Disk Cleanup) performed.. Oct 07, 2021 · However, when the program is running, the “"d:\test.pdf" path is resolved to the client physical path. This might cause two problems: 1. There is no “"d:\test.pdf" on the client machine. 2. The program has not got enough permission to access the file.. class="algoSlug_icon" data-priority="2">Web. Python answers related to “ninja: error: loading 'build.ninja': The system cannot find the file specified.” subprocess the system cannot find the file specified ImportError: DLL load failed while importing win32api: The specified procedure could not be found.. class="algoSlug_icon" data-priority="2">Web. class="algoSlug_icon" data-priority="2">Web.

A person scooping ice cream with the Zeroll Original Ice Cream Scoop.
tl

Can't compile skia, because it can't find build.ninja. `C:\Users\mints\deps\skia>ninja -C out/Release-x64 skia modules ninja: error: loading 'build.ninja': The system cannot find the file specified. ninja: Entering directory out/Release-x64' I have no idea how to fix this. Aseprite and System version. System: Windows 10. Aug 29, 2018 · Building on Mac only works without headless.gn. The reason for that is that the headless windowing system (ozone's headless platform in particular) that we use on Linux/Win and is configured in headless.gn isn't yet supported on Mac.. -- Project version: 1 -- Building ESP-IDF components for target esp32 -- Checking Python dependencies... CMake Error at C:/esp/esp-idf/tools/cmake/build.cmake:252 (message): Some Python dependencies must be installed. Check above message for details. Call Stack (most recent call first):. If the files were in use, the setup will request a restart. You should be able to perform backups now. Method 2: Make a copy of the sqlvdi.dll from the locations: C:Program Files (x86)Microsoft SQL Server80COM and C:Program FilesMicrosoft SQL Server80COM Download the hotfix package from KB 913100. The error message then goes off the right hand side of the box. The 999999 changes each time I run the set up. After each attempt I run a full Level 4 uninstall to make sure all HP programmes are deleted but the same error problem occurs. This message occurs running both the basic and full driver installation programme. Jan 19, 2020 · #Here it is from wifi import Cell, Scheme Cell.all. Oct 25, 2019 · The text was updated successfully, but these errors were encountered:. Cannon build any projects: ninja: error: loading 'build.ninja': The system cannot find the file specified. Post by c4corvettelover » Mon Oct 03, 2022 6:34 pm Hello,.

The Siam Passport Cover in red.
yb

Jan 10, 2022 · ninja: error: loading 'build.ninja': The system cannot find the file specified. The terminal process "C:\WINDOWS\System32\WindowsPowerShell\v1.0\powershell.exe -Command ninja " terminated with exit code: 1. This error could be because PowerShell is unable to find the ninja executable. Could you try to install them separately and see if that helps.

Oct 03, 2022 · ninja: error: loading 'build.ninja': The system cannot find the file specified. Build complete (0 errors, 0 warnings): C:\Espressif\frameworks\esp-idf-v5.0\workspace\blink\build Total time taken to build the project: 12,018 ms I would appreciate any help! Thanks, Steve ESP_kumekay Posts: 5 Joined: Thu Nov 03, 2016 3:43 pm. -- Project version: 1 -- Building ESP-IDF components for target esp32 -- Checking Python dependencies... CMake Error at C:/esp/esp-idf/tools/cmake/build.cmake:252 (message): Some Python dependencies must be installed. Check above message for details. Call Stack (most recent call first):. You can now compile ESP-IDF projects. Go to the project directory and run: idf.py build [0/1] Re-running CMake... FAILED: build.ninja C:\Users\uwe\.espressif\tools\cmake\3.16.4\bin\cmake.exe -SC:\Users\uwe\Documents\Daten\Matrix\dstike_uhr -BC:\Users\uwe\Documents\Daten\Matrix\dstike_uhr\build. aria-expanded="false">. If the files were in use, the setup will request a restart. You should be able to perform backups now. Method 2: Make a copy of the sqlvdi.dll from the locations: C:Program Files (x86)Microsoft SQL Server80COM and C:Program FilesMicrosoft SQL Server80COM Download the hotfix package from KB 913100. 2. The second step is to wait for the scan to complete patiently. This might take a few minutes. If things go well, then you will receive a text that reads 'Windows Resource Protection did not find any integrity violations.' Then if you further get a message that reads 'Windows Resource Protection found corrupt files and repaired them,' it means that your corrupted or missing files. class="algoSlug_icon" data-priority="2">Web.

The Brightland olive oil duo.
hy

Run the Arduino IDE in portable mode by creating a folder named portable in the Arduino IDE installation folder and restarting the Arduino IDE. Uninstall the Arduino IDE and delete the AppData\Local\Arduino15 and AppData\Remote\Arduino15 folders, then reinstall the Arduino IDE. Please be very cautious when deleting files on your computer.

Please mark this reply as the answer or vote as helpful, as appropriate, to make it useful for other readers. Sep 18, 2020 · Executing task in folder MyFirstESP32C3: ninja < ninja: error: loading ‘build.ninja’: No such file or directory The terminal process “/bin/bash ‘-c’, 'ninja '” failed to launch (exit code: 1). I’m not sure why there are so many people who have this issue (google it) and yet there never seems to be a solution that works for everyone.. To resolve this installation error: Perform a clean uninstall of Fusion 360 using the Fusion Cleanup Tool Clear the TEMP folder using the following steps: Click the Windows Start button. In the Run box type %TEMP% and press Enter. Highlight and delete all files. Ignore any files in use. Disable User Account Control from Control Panel. ninja: error: loading 'build.ninja': The system cannot find the file specified." If I want to build any target (with right click -> build) with Ninja it does not work and it does not have to be the custom target. It shows the same message as above. Aug 29, 2018 · Building on Mac only works without headless.gn. The reason for that is that the headless windowing system (ozone's headless platform in particular) that we use on Linux/Win and is configured in headless.gn isn't yet supported on Mac.. May 19, 2022 · > Executing task: ninja < ninja: error: loading 'build.ninja': The system cannot find the file specified. The terminal process "C:\WINDOWS\System32\WindowsPowerShell\v1.0\powershell.exe -Command ninja " terminated with exit code: 1. I have tested all the ways I can find to fix it but I'm not sure anything I missed or not.. Answering to my self and to whom is looking for answer the command to generate the ninja files is (dont miss the "args" : gn args out.gn\x64.debug. class="algoSlug_icon" data-priority="2">Web.

The Kikkerland Solar-Powered Rainbow Maker.
qq

Aug 29, 2018 · Building on Mac only works without headless.gn. The reason for that is that the headless windowing system (ozone's headless platform in particular) that we use on Linux/Win and is configured in headless.gn isn't yet supported on Mac.. Aug 29, 2018 · Building on Mac only works without headless.gn. The reason for that is that the headless windowing system (ozone's headless platform in particular) that we use on Linux/Win and is configured in headless.gn isn't yet supported on Mac.. Sep 24, 2021 · To do this, open the command line by right-clicking on Start and selecting Command Prompt (as administrator). In Command Prompt, type the following command: “sfc /scannow”. Now press Enter. After scanning and correcting errors, restart the computer and check if the “system cannot find the file specifiederror is fixed. Method 4.. Nov 21, 2022 · Solutions to Fix the ErrorThe System Cannot find the File Specified are: First: Perform manual troubleshooting methods, or Second: Take the computer to an IT specialists The manual troubleshooting methods are described below: Method 1: Run Antivirus software The virus, cyber threats, and malicious attack are the common source of error.. class="algoSlug_icon" data-priority="2">Web. Oct 07, 2021 · However, when the program is running, the “"d:\test.pdf" path is resolved to the client physical path. This might cause two problems: 1. There is no “"d:\test.pdf" on the client machine. 2. The program has not got enough permission to access the file..

Three bags of Atlas Coffee Club coffee beans.
qx

Aug 29, 2018 · Building on Mac only works without headless.gn. The reason for that is that the headless windowing system (ozone's headless platform in particular) that we use on Linux/Win and is configured in headless.gn isn't yet supported on Mac..

. Aug 29, 2018 · Building on Mac only works without headless.gn. The reason for that is that the headless windowing system (ozone's headless platform in particular) that we use on Linux/Win and is configured in headless.gn isn't yet supported on Mac.. . Oct 07, 2021 · However, when the program is running, the “"d:\test.pdf" path is resolved to the client physical path. This might cause two problems: 1. There is no “"d:\test.pdf" on the client machine. 2. The program has not got enough permission to access the file.. Python answers related to “ninja: error: loading 'build.ninja': The system cannot find the file specified.” subprocess the system cannot find the file specified ImportError: DLL load failed while importing win32api: The specified procedure could not be found.. class="algoSlug_icon" data-priority="2">Web. Aug 29, 2018 · Building on Mac only works without headless.gn. The reason for that is that the headless windowing system (ozone's headless platform in particular) that we use on Linux/Win and is configured in headless.gn isn't yet supported on Mac.. Aug 29, 2018 · Building on Mac only works without headless.gn. The reason for that is that the headless windowing system (ozone's headless platform in particular) that we use on Linux/Win and is configured in headless.gn isn't yet supported on Mac.. Aug 29, 2018 · Building on Mac only works without headless.gn. The reason for that is that the headless windowing system (ozone's headless platform in particular) that we use on Linux/Win and is configured in headless.gn isn't yet supported on Mac.. DISM: The system cannot find the file specified when the file exists. in General Support I used the following lines in a CMD script: If exist "D:\CAB\WinPE-FontSupport-ZH-TW.cab" (echo The font file exists. >> "%Log%") If exist "D:\CAB\lp.cab" (echo The lp file exists. >> "%Log%") DISM /image:%X% /add-package.

Two small weights and a ClassPass gift card and envelope.
qd

al

ntdll The system cannot find the file specified You can troubleshoot most symbol related issues by turning on symbol loading diagnostics (!sym noisy) and repeating the command that caused symbols to be loaded. You should also verify that your symbol search path (.sympath) is correct. For analysis of this file, run !analyze -v. Sep 18, 2020 · Executing task in folder MyFirstESP32C3: ninja < ninja: error: loading ‘build.ninja’: No such file or directory The terminal process “/bin/bash ‘-c’, 'ninja '” failed to launch (exit code: 1). I’m not sure why there are so many people who have this issue (google it) and yet there never seems to be a solution that works for everyone.. Click on the Start menu and select Control Panel Click on Programs and Features Select Turn Windows features on or off Check the box next to Internet Explorer and click OK Launch Sage ACT! and test Internet Explorer Registry Keys Incorrect Close Sage ACT! Using Windows Explorer, search for iexplore.exe; note file path Default locations are:. Oct 22, 2022 · Open Settings by pressing the Windows key + I and click on the Windows update tab on left If an update is available, click on the Download & Install option If any updates are not available, click on the Check for updates button Additionally, you can also look for updates in the Optional updates section by selecting Advanced Options. . ninja: error: loading 'build.ninja': The system cannot find the file specified. ------------------------------------------------------------- Command exited with code 1 Executable: C:\Program Files (x86)\Sysprogs\VisualGDB/ninja.exe Arguments: clean Directory: d:\Projects\pi\pislm2/Debug Command-line action failed Where does build.ninja come from?. Nov 26, 2021 · The account runersystem is local system user and member of Administrator and Power users groups. Windows 10 to accept File Paths Over 260 Characters enabled HKEY_LOCAL_MACHINE\SYSTEM\CurrentControlSet\Control\FileSystem - LongPathsEnabled - 1. Windows Update performed. Antivirus Un-installed. Disk cleanup (Using Disk Cleanup) performed..

A navy blue Bearaby Napper weighted blanket draped across the back of a sofa.
gl

au

Aug 29, 2018 · Building on Mac only works without headless.gn. The reason for that is that the headless windowing system (ozone's headless platform in particular) that we use on Linux/Win and is configured in headless.gn isn't yet supported on Mac.. ntdll The system cannot find the file specified. You can troubleshoot most symbol related issues by turning on symbol loading diagnostics (!sym noisy) and repeating the command that caused symbols to be loaded. You should also verify that your symbol search path (.sympath) is correct. For analysis of this file, run !analyze -v. Calling it now on Server 2012, the cluster service got my non standard privilege granted, but lost the privileges to load a driver and to shut down the system, that it has already had. A restart of the cluster service alone worked and - equipped with the new privileges - my cluster resource dll also worked. class="algoSlug_icon" data-priority="2">Web. Oct 03, 2022 · ninja: error: loading 'build.ninja': The system cannot find the file specified. Build complete (0 errors, 0 warnings): C:\Espressif\frameworks\esp-idf-v5.0\workspace\blink\build Total time taken to build the project: 12,018 ms I would appreciate any help! Thanks, Steve ESP_kumekay Posts: 5 Joined: Thu Nov 03, 2016 3:43 pm.

A digital photo frame from Aura Frames, a great gift for those who have everything, with a parent and toddler on the screen.
pg

fg

Aug 29, 2018 · environment :Mac Install ninja with the brew intsall ninja command then on terminal execute ninja occur ninja: error: loading &#39;build.ninja&#39;: No such file or directory 。 ~ ninja ninja: err.... ntdll The system cannot find the file specified You can troubleshoot most symbol related issues by turning on symbol loading diagnostics (!sym noisy) and repeating the command that caused symbols to be loaded. You should also verify that your symbol search path (.sympath) is correct. For analysis of this file, run !analyze -v. class="algoSlug_icon" data-priority="2">Web. class="algoSlug_icon" data-priority="2">Web. this page" aria-label="Show more" role="button" aria-expanded="false">. File will be read, as file Exists, under the Data folder, and path is correct"); file = new File ("Data\\TestValues.txt"); System.out.println ("\t"+ "Path : " + file.getAbsolutePath ()); } } Output: Throws Exception as file does not Exists, Dummy File Name, to find the path Path : C:\WorkSpace\CodeWorkSpace\OCJD\JavaCertification\TestValues.txt. Sep 24, 2021 · To do this, open the command line by right-clicking on Start and selecting Command Prompt (as administrator). In Command Prompt, type the following command: “sfc /scannow”. Now press Enter. After scanning and correcting errors, restart the computer and check if the “system cannot find the file specifiederror is fixed. Method 4..

Caran d’Ache 849 Brut Rosé pen, a great gift for those who have everything, next to its matching gold tone box.
gj

i am facing this error : The system cannot find the file specified.Failed to process [isFileExists] i changed the checkpoint location as shown in previous KB (older version : https://www.veeam.com/kb2890) disabled/enabled checkpoints renamed VM name application aware on/off but this did not solve the issue server is fully updated.

Nov 21, 2022 · Solutions to Fix the ErrorThe System Cannot find the File Specified are: First: Perform manual troubleshooting methods, or Second: Take the computer to an IT specialists The manual troubleshooting methods are described below: Method 1: Run Antivirus software The virus, cyber threats, and malicious attack are the common source of error.. To resolve this installation error: Perform a clean uninstall of Fusion 360 using the Fusion Cleanup Tool Clear the TEMP folder using the following steps: Click the Windows Start button. In the Run box type %TEMP% and press Enter. Highlight and delete all files. Ignore any files in use. Disable User Account Control from Control Panel. Sep 18, 2020 · Executing task in folder MyFirstESP32C3: ninja < ninja: error: loading ‘build.ninja’: No such file or directory The terminal process “/bin/bash ‘-c’, 'ninja '” failed to launch (exit code: 1). I’m not sure why there are so many people who have this issue (google it) and yet there never seems to be a solution that works for everyone.. ntdll The system cannot find the file specified. You can troubleshoot most symbol related issues by turning on symbol loading diagnostics (!sym noisy) and repeating the command that caused symbols to be loaded. You should also verify that your symbol search path (.sympath) is correct. For analysis of this file, run !analyze -v. Run the Arduino IDE in portable mode by creating a folder named portable in the Arduino IDE installation folder and restarting the Arduino IDE. Uninstall the Arduino IDE and delete the AppData\Local\Arduino15 and AppData\Remote\Arduino15 folders, then reinstall the Arduino IDE. Please be very cautious when deleting files on your computer. SQL Server Management Studio (SSMS) is an integrated environment. for managing any SQL infrastructure. Use SSMS to access, configure. manage administer, and develop all components of SQL Server. Azure SQL Database : Azure SQL Managed Instance SQL. Server on Azure VM, and Azure Synapse Analytics. I guess you have tried, some solutions : But give. Cannon build any projects: ninja: error: loading 'build.ninja': The system cannot find the file specified. Post by c4corvettelover » Mon Oct 03, 2022 6:34 pm Hello,.

The Purist Mover water bottle, a great gift for people who have everything, shown in a deep blue color.
sd

class="algoSlug_icon" data-priority="2">Web. Aug 29, 2018 · Building on Mac only works without headless.gn. The reason for that is that the headless windowing system (ozone's headless platform in particular) that we use on Linux/Win and is configured in headless.gn isn't yet supported on Mac.. . Nov 21, 2022 · Solutions to Fix the ErrorThe System Cannot find the File Specified are: First: Perform manual troubleshooting methods, or Second: Take the computer to an IT specialists The manual troubleshooting methods are described below: Method 1: Run Antivirus software The virus, cyber threats, and malicious attack are the common source of error.. Nov 26, 2021 · The account runersystem is local system user and member of Administrator and Power users groups. Windows 10 to accept File Paths Over 260 Characters enabled HKEY_LOCAL_MACHINE\SYSTEM\CurrentControlSet\Control\FileSystem - LongPathsEnabled - 1 Windows Update performed Antivirus Un-installed. Disk cleanup (Using Disk Cleanup) performed..

The Oura ring on a person's right middle finger, a great gift for people who have everything.
nk

za

Oct 22, 2022 · Open Settings by pressing the Windows key + I and click on the Windows update tab on left If an update is available, click on the Download & Install option If any updates are not available, click on the Check for updates button Additionally, you can also look for updates in the Optional updates section by selecting Advanced Options. The system cannot find the file specified. 58:03.331: Opening COM1 8228,8,N,1 Cheers, Scott June 13th, 2014 #2. limited cv8r. View Profile View Forum Posts Lifetime Member Join Date May 2005 Posts 568 ... 11:13.132: Error: Reply frame checksum failure 11:13.156: Error: No echo received from MAX232. Nov 26, 2021 · The account runersystem is local system user and member of Administrator and Power users groups. Windows 10 to accept File Paths Over 260 Characters enabled HKEY_LOCAL_MACHINE\SYSTEM\CurrentControlSet\Control\FileSystem - LongPathsEnabled - 1. Windows Update performed. Antivirus Un-installed. Disk cleanup (Using Disk Cleanup) performed.. Oct 22, 2022 · list disk and press the Enter key Make sure that the disk shown here is properly connected and healthy. If not, power off the device and check for connections. If the device is shown, proceed to select the disk and firstly clean it to create a partition.. Python answers related to “ninja: error: loading 'build.ninja': The system cannot find the file specified.” subprocess the system cannot find the file specified ImportError: DLL load failed while importing win32api: The specified procedure could not be found. core\\urls.py'>' does not appear to have any patterns in it.. CMake Error: CMake was unable to find a build program corresponding to "Ninja". CMAKE_MAKE_PROGRAM is not set. You probably need to select a different build tool..

A person works at a kitchen counter wearing the canvas Hedley & Bennett Crossback Apron, one of our best housewarming gifts.
sy

Hold the Windows key and press R, then type devmgmt.msc Please respond to all the following steps.. Under Network adapters, please tell me all the devices listed.; Are there any devices under Network adapters that have a red x displayed?; Also, are there any devices anywhere in the Device Manager display with yellow ? or ! displayed?; Try these simple tests. Hold the Windows key and press R.

What we can try next, is to: close VMware Workstation, or at least the VM's tab. set scsi0:0.fileName = "mdServer-000006.vmdk" in the VM's configuration ( .vmx) file. create another snapshot, to ensure that the current .vmdk files won't get modified. try to power on the VM. ninja: error: loading 'build.ninja': The system cannot find the file specified. Build complete (0 errors, 0 warnings): C:\Espressif\frameworks\esp-idf-v5.0\workspace\blink\build Total time taken to build the project: 12,018 ms I would appreciate any help! Thanks, Steve ESP_kumekay Posts: 5 Joined: Thu Nov 03, 2016 3:43 pm. File will be read, as file Exists, under the Data folder, and path is correct"); file = new File ("Data\\TestValues.txt"); System.out.println ("\t"+ "Path : " + file.getAbsolutePath ()); } } Output: Throws Exception as file does not Exists, Dummy File Name, to find the path Path : C:\WorkSpace\CodeWorkSpace\OCJD\JavaCertification\TestValues.txt. Error: The System cannot find the file specified. Please support in troubleshooting the same. Customization / Solutions / SDK and API Dynamics 365 Administration Dynamics365 dynamics365 #dynamics #training dynamics365 #MSDyn365CE DynamicsCRM #organisationalInsights. class="algoSlug_icon" data-priority="2">Web. The system cannot find the file specified Note This error message indicates that the IAdminIndexServer object cannot access the indexing services on Server A correctly. Resolution Hotfix information A supported hotfix is available from Microsoft. However, this hotfix is intended to correct only the problem that is described in this article.

A bouquet of Urban Stems flowers, a great gift for people who have everything, set in a white vase..
tf

Dec 01, 2021 · Another effective approach to fix the system cannot find the file specified error is to check the system log files. The steps are: Navigate to C:/Windows/inf directory. Open inf folder. Find file setupapi.dev, and then double-click on it to open the file. ( In some cases, the file would be setupapi.dev.log.).

Hands holding a blue book of the Month welcome card, one of the best gifts for people who have everything.
yt

12-Feb-2013 21:08:42 sbvol 504 - cannot query incremental tracking state (-2 the system cannot find the specified file) This is likely a problem with corrupt registry settings from a previous installation of ShadowProtect that was not completely removed or another conflicting backup program is causing some interference.

Aug 29, 2018 · Building on Mac only works without headless.gn. The reason for that is that the headless windowing system (ozone's headless platform in particular) that we use on Linux/Win and is configured in headless.gn isn't yet supported on Mac.. The error message then goes off the right hand side of the box. The 999999 changes each time I run the set up. After each attempt I run a full Level 4 uninstall to make sure all HP programmes are deleted but the same error problem occurs. This message occurs running both the basic and full driver installation programme. class="algoSlug_icon" data-priority="2">Web. Aug 29, 2018 · Building on Mac only works without headless.gn. The reason for that is that the headless windowing system (ozone's headless platform in particular) that we use on Linux/Win and is configured in headless.gn isn't yet supported on Mac.. Oct 22, 2022 · list disk and press the Enter key Make sure that the disk shown here is properly connected and healthy. If not, power off the device and check for connections. If the device is shown, proceed to select the disk and firstly clean it to create a partition.. Nov 26, 2021 · The account runersystem is local system user and member of Administrator and Power users groups. Windows 10 to accept File Paths Over 260 Characters enabled HKEY_LOCAL_MACHINE\SYSTEM\CurrentControlSet\Control\FileSystem - LongPathsEnabled - 1. Windows Update performed. Antivirus Un-installed. Disk cleanup (Using Disk Cleanup) performed..

A TisBest Charity Gift Card, one of the best gifts for people who have everything.
tu

du

Oct 22, 2022 · Open Settings by pressing the Windows key + I and click on the Windows update tab on left If an update is available, click on the Download & Install option If any updates are not available, click on the Check for updates button Additionally, you can also look for updates in the Optional updates section by selecting Advanced Options. Hi, Thanks for posting on our forum! First of all, I agree with the way in the article that @DSPatrick gave you. Secondly, I think if you download the latest version of CheckSUR.log file, your Windows update will be working fine. Cannon build any projects: ninja: error: loading 'build.ninja': The system cannot find the file specified. Post by c4corvettelover » Mon Oct 03, 2022 6:34 pm Hello,. Aug 29, 2018 · Building on Mac only works without headless.gn. The reason for that is that the headless windowing system (ozone's headless platform in particular) that we use on Linux/Win and is configured in headless.gn isn't yet supported on Mac.. Aug 29, 2018 · Building on Mac only works without headless.gn. The reason for that is that the headless windowing system (ozone's headless platform in particular) that we use on Linux/Win and is configured in headless.gn isn't yet supported on Mac.. Nov 21, 2022 · Solutions to Fix the ErrorThe System Cannot find the File Specified are: First: Perform manual troubleshooting methods, or Second: Take the computer to an IT specialists The manual troubleshooting methods are described below: Method 1: Run Antivirus software The virus, cyber threats, and malicious attack are the common source of error..

The Recchiuti Confections Black Box, one of the best gifts for people who have everything, open to show nestled chocolates.
fk

mp

Oct 25, 2019 · The text was updated successfully, but these errors were encountered:. Python answers related to “ninja: error: loading 'build.ninja': The system cannot find the file specified.” subprocess the system cannot find the file specified ImportError: DLL load failed while importing win32api: The specified procedure could not be found.. class="algoSlug_icon" data-priority="2">Web. I sometimes see the following error: "ninja: error: loading 'build.ninja': The system cannot find the file specified." I do: build.cmd clr.runtime. Level: Error Keywords: User: SYSTEM Computer: HV01.dom.loc Description: Hyper-V could not replicate changes for virtual machine 'TEST_EX2013_EX03': The system cannot find the file specified. (0x80070002). (Virtual Machine ID 5F371582-92E0-4222-89E1-33671CEF20C3) Event Xml: <Event xmlns="http://schemas.microsoft.com/win/2004/08/events/event">.

A leather Cuyana Classic Easy Tote in beige.
rt

ye

I sometimes see the following error: "ninja: error: loading 'build.ninja': The system cannot find the file specified." I do: build.cmd clr.runtime. class="algoSlug_icon" data-priority="2">Web. Aug 29, 2018 · Building on Mac only works without headless.gn. The reason for that is that the headless windowing system (ozone's headless platform in particular) that we use on Linux/Win and is configured in headless.gn isn't yet supported on Mac.. I sometimes see the following error: "ninja: error: loading 'build.ninja': The system cannot find the file specified." I do: build.cmd clr.runtime. class="algoSlug_icon" data-priority="2">Web. Auto-suggest helps you quickly narrow down your search results by suggesting possible matches as you type.

The SodaStream Fizzi OneTouch on a kitchen counter next to a glass and a full bottle of sparkling water.
aj

ej

Python answers related to “ninja: error: loading 'build.ninja': The system cannot find the file specified.” subprocess the system cannot find the file specified ImportError: DLL load failed while importing win32api: The specified procedure could not be found.. Python answers related to “ninja: error: loading 'build.ninja': The system cannot find the file specified.” subprocess the system cannot find the file specified ImportError: DLL load failed while importing win32api: The specified procedure could not be found.. Oct 30, 2018 · ninja: error: loading 'build.ninja': The system cannot find the file specified. ninja: Entering directory ` out.gn \x64.debug' out.gn \x64.debug\ args.gn looks like this :.... Sep 24, 2021 · Unfortunately, inaction can lead to errors, like “the system cannot find the file specified”. Therefore, upgrade Windows using the following recommendations: Press Windows + I at the same time, then click on the “Update and Security” tab.. class="algoSlug_icon" data-priority="2">Web.

Two small cacti in Stacking Planter by Chen Chen & Kai Williams, one of the best gifts for people who have everything
jy

ninja: error: loading 'build.ninja': The system cannot find the file specified. ninja: Entering directory ` out.gn \x64.debug' out.gn \x64.debug\ args.gn looks like this :.

-- Project version: 1 -- Building ESP-IDF components for target esp32 -- Checking Python dependencies... CMake Error at C:/esp/esp-idf/tools/cmake/build.cmake:252 (message): Some Python dependencies must be installed. Check above message for details. Call Stack (most recent call first):. Oct 03, 2022 · ninja: error: loading 'build.ninja': The system cannot find the file specified. Build complete (0 errors, 0 warnings): C:\Espressif\frameworks\esp-idf-v5.0\workspace\blink\build Total time taken to build the project: 12,018 ms I would appreciate any help! Thanks, Steve ESP_kumekay Posts: 5 Joined: Thu Nov 03, 2016 3:43 pm. Level: Error Keywords: User: SYSTEM Computer: HV01.dom.loc Description: Hyper-V could not replicate changes for virtual machine 'TEST_EX2013_EX03': The system cannot find the file specified. (0x80070002). (Virtual Machine ID 5F371582-92E0-4222-89E1-33671CEF20C3) Event Xml: <Event xmlns="http://schemas.microsoft.com/win/2004/08/events/event">. Python answers related to “ninja: error: loading 'build.ninja': The system cannot find the file specified.” subprocess the system cannot find the file specified ImportError: DLL load failed while importing win32api: The specified procedure could not be found. core\\urls.py'>' does not appear to have any patterns in it..

A red cardboard box full of wrapped cured meats and jarred cheeses and jams from Olympia Provisions.
xu

i am facing this error : The system cannot find the file specified.Failed to process [isFileExists] i changed the checkpoint location as shown in previous KB (older version : https://www.veeam.com/kb2890) disabled/enabled checkpoints renamed VM name application aware on/off but this did not solve the issue server is fully updated. Build failed on Win 10 64bit: ninja: fatal: CreateProcess: The system cannot find the file specified. #25. Open Ben-Mack opened this ... CreateProcess: The system cannot find the file specified. ninja: build stopped: subcommand failed. ... ninja: build stopped: subcommand failed. ERROR: Build failed. Any help is greatly appreciated! The text. Executing task: ninja < ninja: error: loading 'build.ninja': The system cannot find the file specified. The terminal process "C:\WINDOWS\System32\WindowsPowerShell\v1.0\powershell.exe -Command ninja " terminated with exit code: 1. Executing task: ninja < ninja: error: loading 'build.ninja': The system cannot find the file specified. Re: The system cannot find the file specified. Veeam Support says that the logs gathered indicates that it is an issue with the Shadow Copies writing to the USB backup drive. This seems to be the case, even though the shadow copies are disabled they show large amounts of data on the USB backup drives. I have changed the backup location and. this page" aria-label="Show more" role="button" aria-expanded="false">. Jan 19, 2020 · #Here it is from wifi import Cell, Scheme Cell.all.

The Yeti Lowlands Blanket in blue.
ti

xo

Python answers related to “ninja: error: loading 'build.ninja': The system cannot find the file specified.” subprocess the system cannot find the file specified ImportError: DLL load failed while importing win32api: The specified procedure could not be found. core\\urls.py'>' does not appear to have any patterns in it.. The system cannot find the file specified. 58:03.331: Opening COM1 8228,8,N,1 Cheers, Scott June 13th, 2014 #2. limited cv8r. View Profile View Forum Posts Lifetime Member Join Date May 2005 Posts 568 ... 11:13.132: Error: Reply frame checksum failure 11:13.156: Error: No echo received from MAX232. Oct 25, 2019 · The text was updated successfully, but these errors were encountered:. ntdll The system cannot find the file specified. You can troubleshoot most symbol related issues by turning on symbol loading diagnostics (!sym noisy) and repeating the command that caused symbols to be loaded. You should also verify that your symbol search path (.sympath) is correct. For analysis of this file, run !analyze -v. May 09, 2020 · There were no errors while installing, but when I try to build something, i get this error: Code: Select all > Executing task: cmake --build . < ninja: error: loading 'build.ninja': The system cannot find the file specified. The terminal process "C:\WINDOWS\System32\WindowsPowerShell\v1.0\powershell.exe -Command cmake --build .".

A Wyze Bulb Color displayed against a light blue background.
ir

af

Dec 01, 2021 · Another effective approach to fix the system cannot find the file specified error is to check the system log files. The steps are: Navigate to C:/Windows/inf directory. Open inf folder. Find file setupapi.dev, and then double-click on it to open the file. ( In some cases, the file would be setupapi.dev.log.). title="Explore this page" aria-label="Show more" role="button" aria-expanded="false">. Dec 01, 2021 · Another effective approach to fix the system cannot find the file specified error is to check the system log files. The steps are: Navigate to C:/Windows/inf directory. Open inf folder. Find file setupapi.dev, and then double-click on it to open the file. ( In some cases, the file would be setupapi.dev.log.). Chances are you can delete the MDS (well, move them to another folder) and then just burn the ISO - it'll only potentially be an issue if the images were double layer ones. Or if you're really desperate, hex edit the MDS file and change the file name stored at the end of the file to whatever the new one (of the ISO file) is. Go to topic listing. class="algoSlug_icon" data-priority="2">Web. ninja: error: loading 'build.ninja': The system cannot find the file specified. ninja: Entering directory ` out.gn \x64.debug' out.gn \x64.debug\ args.gn looks like this :.

Card for the National Parks Annual Pass, one of the best gifts for people who have everything.
bd

Calling it now on Server 2012, the cluster service got my non standard privilege granted, but lost the privileges to load a driver and to shut down the system, that it has already had. A restart of the cluster service alone worked and - equipped with the new privileges - my cluster resource dll also worked.

class="algoSlug_icon" data-priority="2">Web. The system cannot find the file specified Note This error message indicates that the IAdminIndexServer object cannot access the indexing services on Server A correctly. Resolution Hotfix information A supported hotfix is available from Microsoft. However, this hotfix is intended to correct only the problem that is described in this article. Please mark this reply as the answer or vote as helpful, as appropriate, to make it useful for other readers. Sep 24, 2021 · Unfortunately, inaction can lead to errors, like “the system cannot find the file specified”. Therefore, upgrade Windows using the following recommendations: Press Windows + I at the same time, then click on the “Update and Security” tab.. I sometimes see the following error: "ninja: error: loading 'build.ninja': The system cannot find the file specified." I do: build.cmd clr.runtime.

The packaging of the Embark dog DNA test.
nd

Aug 29, 2018 · Building on Mac only works without headless.gn. The reason for that is that the headless windowing system (ozone's headless platform in particular) that we use on Linux/Win and is configured in headless.gn isn't yet supported on Mac..

SQL Server Management Studio (SSMS) is an integrated environment. for managing any SQL infrastructure. Use SSMS to access, configure. manage administer, and develop all components of SQL Server. Azure SQL Database : Azure SQL Managed Instance SQL. Server on Azure VM, and Azure Synapse Analytics. I guess you have tried, some solutions : But give. Aug 29, 2018 · Building on Mac only works without headless.gn. The reason for that is that the headless windowing system (ozone's headless platform in particular) that we use on Linux/Win and is configured in headless.gn isn't yet supported on Mac.. It that case its likely cmake does not generate the build.ninja file, though I don't know why. Here's what I suggest. - Delete folders build/ and dist/ - Open windows command prompt CMD - CD to the root of the source code - Run "build.cmd >log.txt" and paste the created log here. Maybe it'll tell something useful. Best, Jussi AliceB Posts: 12. class="algoSlug_icon" data-priority="2">Web. Oct 22, 2022 · list disk and press the Enter key Make sure that the disk shown here is properly connected and healthy. If not, power off the device and check for connections. If the device is shown, proceed to select the disk and firstly clean it to create a partition..

The Dansk Kobenstyle Butter Warmer, in white, full of milk.
df

Aug 29, 2018 · Building on Mac only works without headless.gn. The reason for that is that the headless windowing system (ozone's headless platform in particular) that we use on Linux/Win and is configured in headless.gn isn't yet supported on Mac..

Sep 18, 2020 · Executing task in folder MyFirstESP32C3: ninja < ninja: error: loading ‘build.ninja’: No such file or directory The terminal process “/bin/bash ‘-c’, 'ninja '” failed to launch (exit code: 1). I’m not sure why there are so many people who have this issue (google it) and yet there never seems to be a solution that works for everyone.. class="algoSlug_icon" data-priority="2">Web. Oct 25, 2019 · The text was updated successfully, but these errors were encountered:. CMake Error: CMake was unable to find a build program corresponding to "Ninja". CMAKE_MAKE_PROGRAM is not set. You probably need to select a different build tool.. So there is clearly an issue with the builder not detecting the correct installation location of the windows kit. LESSONS LEARNED: 1. Double check the prerequisites; 2. If your Windows SDK is in a non-standard location, just create a symbolic directory link. If there's a better way to fix this, let me know, but at least I found a work-around. class="algoSlug_icon" data-priority="2">Web.

The Vitruvi Stone Diffuser in white.
gu

ec

If the files were in use, the setup will request a restart. You should be able to perform backups now. Method 2: Make a copy of the sqlvdi.dll from the locations: C:Program Files (x86)Microsoft SQL Server80COM and C:Program FilesMicrosoft SQL Server80COM Download the hotfix package from KB 913100. class="algoSlug_icon" data-priority="2">Web. Aug 29, 2018 · Building on Mac only works without headless.gn. The reason for that is that the headless windowing system (ozone's headless platform in particular) that we use on Linux/Win and is configured in headless.gn isn't yet supported on Mac.. Aug 29, 2018 · Building on Mac only works without headless.gn. The reason for that is that the headless windowing system (ozone's headless platform in particular) that we use on Linux/Win and is configured in headless.gn isn't yet supported on Mac.. Oct 07, 2021 · System.ComponentModel.Win32Exception: The system cannot find the file specified at System.Diagnostics.Process.StartWithShellExecuteEx(ProcessStartInfo startInfo) at System.Diagnostics.Process.Start() at System.Diagnostics.Process.Start(ProcessStartInfo startInfo) at Letter_Trigg.Execution(String strCmdLine) in d:\Xp Xtreme - Hodge life\XPXHL ....

The Criterion Channel streaming service landing page, with their logo superimposed over a collage of movie posters.
xj

Auto-suggest helps you quickly narrow down your search results by suggesting possible matches as you type. Jan 19, 2020 · #Here it is from wifi import Cell, Scheme Cell.all. class="algoSlug_icon" data-priority="2">Web. Aug 29, 2018 · Building on Mac only works without headless.gn. The reason for that is that the headless windowing system (ozone's headless platform in particular) that we use on Linux/Win and is configured in headless.gn isn't yet supported on Mac.. ninja: error: loading 'build.ninja': The system cannot find the file specified." If I want to build any target (with right click -> build) with Ninja it does not work and it does not have to be the custom target. It shows the same message as above. class="algoSlug_icon" data-priority="2">Web.

The Phillips Wake-Up light.
kd

mq

class="algoSlug_icon" data-priority="2">Web. -- Project version: 1 -- Building ESP-IDF components for target esp32 -- Checking Python dependencies... CMake Error at C:/esp/esp-idf/tools/cmake/build.cmake:252 (message): Some Python dependencies must be installed. Check above message for details. Call Stack (most recent call first):. In case 'HKLM:\SYSTEM\CurrentControlSet\Services\Dnscache\Parameters\DnsPolicyConfig' already exists and fix didn't help, try to export it (just in case), delete it and ruh the PS code again. Like Sponsor. Sep 24, 2021 · To do this, open the command line by right-clicking on Start and selecting Command Prompt (as administrator). In Command Prompt, type the following command: “sfc /scannow”. Now press Enter. After scanning and correcting errors, restart the computer and check if the “system cannot find the file specifiederror is fixed. Method 4.. What we can try next, is to: close VMware Workstation, or at least the VM's tab. set scsi0:0.fileName = "mdServer-000006.vmdk" in the VM's configuration ( .vmx) file. create another snapshot, to ensure that the current .vmdk files won't get modified. try to power on the VM. Aug 29, 2018 · Building on Mac only works without headless.gn. The reason for that is that the headless windowing system (ozone's headless platform in particular) that we use on Linux/Win and is configured in headless.gn isn't yet supported on Mac.. > Executing task: ninja < ninja: error: loading 'build.ninja': The system cannot find the file specified. The terminal process "C:\WINDOWS\System32\WindowsPowerShell\v1.0\powershell.exe -Command ninja " terminated with exit code: 1. I have tested all the ways I can find to fix it but I'm not sure anything I missed or not. class="algoSlug_icon" data-priority="2">Web.

A person reclines on the armrest of a couch with a hardback book in hand. They are smiling as they read.
dq

sa

Ticket 1(Accesing a smartobject from endpoint assembly throws the following error): The customer resolved the issue internally. The .NET assmeblies were not present on the environment. What we can try next, is to: close VMware Workstation, or at least the VM's tab. set scsi0:0.fileName = "mdServer-000006.vmdk" in the VM's configuration ( .vmx) file. create another snapshot, to ensure that the current .vmdk files won't get modified. try to power on the VM. Python answers related to “ninja: error: loading 'build.ninja': The system cannot find the file specified.” subprocess the system cannot find the file specified ImportError: DLL load failed while importing win32api: The specified procedure could not be found.. class="algoSlug_icon" data-priority="2">Web. Oct 18, 2022 · If you download the driver from the manufacturer’s website and meet “The system cannot find the file specified” problem, then you can try this solution. 1. Right-click This PC > choose Manage > Device Manager. 2. Expand the category and find the device you want to uninstall. 3. Right-click the device and choose Uninstall. 4..

The green glass vintage style bottle of La Gritona Reposado Tequila, one of the best gifts for people who have everything.
af

Sep 18, 2020 · Executing task in folder MyFirstESP32C3: ninja < ninja: error: loading ‘build.ninja’: No such file or directory The terminal process “/bin/bash ‘-c’, 'ninja '” failed to launch (exit code: 1). I’m not sure why there are so many people who have this issue (google it) and yet there never seems to be a solution that works for everyone.. Hi, Thanks for posting on our forum! First of all, I agree with the way in the article that @DSPatrick gave you. Secondly, I think if you download the latest version of CheckSUR.log file, your Windows update will be working fine. Aug 29, 2018 · Building on Mac only works without headless.gn. The reason for that is that the headless windowing system (ozone's headless platform in particular) that we use on Linux/Win and is configured in headless.gn isn't yet supported on Mac.. Cannon build any projects: ninja: error: loading 'build.ninja': The system cannot find the file specified. Post by c4corvettelover » Mon Oct 03, 2022 6:34 pm Hello,. 1 The ninja build system on your computer worked correctly! That error will occur if you run ninja with no arguments. If you add some arguments for it, such as ninja --version and then, It worked! Share Improve this answer Follow answered Mar 27 at 9:50 FlopffyGrape 54 5 Add a comment 0. Oct 07, 2021 · However, when the program is running, the “"d:\test.pdf" path is resolved to the client physical path. This might cause two problems: 1. There is no “"d:\test.pdf" on the client machine. 2. The program has not got enough permission to access the file.. class="algoSlug_icon" data-priority="2">Web. The system cannot find the specified file. My initial impression was that my syntax was incorrect, though I can't spot the error. The path points to "test.cab" which is a renamed windows addon which contains the necessary "svcpack" folder and the "entries_XX.ini" file.

Four Graf Lantz Wool Coasters, a great gift for those who have everything, in a square with a drink on the upper left one.
xo

Oct 03, 2022 · ninja: error: loading 'build.ninja': The system cannot find the file specified. Build complete (0 errors, 0 warnings): C:\Espressif\frameworks\esp-idf-v5.0\workspace\blink\build Total time taken to build the project: 12,018 ms I would appreciate any help! Thanks, Steve ESP_kumekay Posts: 5 Joined: Thu Nov 03, 2016 3:43 pm.

class="algoSlug_icon" data-priority="2">Web. Aug 29, 2018 · Building on Mac only works without headless.gn. The reason for that is that the headless windowing system (ozone's headless platform in particular) that we use on Linux/Win and is configured in headless.gn isn't yet supported on Mac.. Cannon build any projects: ninja: error: loading 'build.ninja': The system cannot find the file specified. Post by c4corvettelover » Mon Oct 03, 2022 6:34 pm Hello,. Sep 18, 2020 · Executing task in folder MyFirstESP32C3: ninja < ninja: error: loading ‘build.ninja’: No such file or directory The terminal process “/bin/bash ‘-c’, 'ninja '” failed to launch (exit code: 1). I’m not sure why there are so many people who have this issue (google it) and yet there never seems to be a solution that works for everyone.. class="algoSlug_icon" data-priority="2">Web. . 2. The second step is to wait for the scan to complete patiently. This might take a few minutes. If things go well, then you will receive a text that reads 'Windows Resource Protection did not find any integrity violations.' Then if you further get a message that reads 'Windows Resource Protection found corrupt files and repaired them,' it means that your corrupted or missing files. Sep 15, 2018 · To clone the disk from the corrupted (unless you had a backup of the missing file) state, run. vmware-vdiskmanager -r mdServer-000006.vmdk -t 1 mdServer-Clone.vmdk This command will consolidate the snapshot chain into a new base virtual disk, i.e. clean up the "AutoProtect" snapshots. André 0 Kudos Share Reply vimay Contributor 09-16-2018 09:13 AM.

The Marset FollowMe Lamp by Inma Bermúdez, a great gift for those who have everything, lit on an intimate dinner table.
eu

To resolve this installation error: Perform a clean uninstall of Fusion 360 using the Fusion Cleanup Tool Clear the TEMP folder using the following steps: Click the Windows Start button. In the Run box type %TEMP% and press Enter. Highlight and delete all files. Ignore any files in use. Disable User Account Control from Control Panel.

Executing task: ninja < ninja: error: loading 'build.ninja': The system cannot find the file specified. The terminal process "C:\WINDOWS\System32\WindowsPowerShell\v1.0\powershell.exe -Command ninja " terminated with exit code: 1. Executing task: ninja < ninja: error: loading 'build.ninja': The system cannot find the file specified. class="algoSlug_icon" data-priority="2">Web. class="algoSlug_icon" data-priority="2">Web. . . You can now compile ESP-IDF projects. Go to the project directory and run: idf.py build [0/1] Re-running CMake... FAILED: build.ninja C:\Users\uwe\.espressif\tools\cmake\3.16.4\bin\cmake.exe -SC:\Users\uwe\Documents\Daten\Matrix\dstike_uhr -BC:\Users\uwe\Documents\Daten\Matrix\dstike_uhr\build. May 19, 2020 · Hello, That sounds like a technical issue. Please provide a support case ID for this issue, as requested when you click New Topic. Without case number, the topic will eventually be. Hi, Thanks for posting on our forum! First of all, I agree with the way in the article that @DSPatrick gave you. Secondly, I think if you download the latest version of CheckSUR.log file, your Windows update will be working fine.

A W + P Collapsible Popcorn Bowl, one of our best gifts, full of popcorn with its lid leaning on the bowl.
kb

Level: Error Keywords: User: SYSTEM Computer: HV01.dom.loc Description: Hyper-V could not replicate changes for virtual machine 'TEST_EX2013_EX03': The system cannot find the file specified. (0x80070002). (Virtual Machine ID 5F371582-92E0-4222-89E1-33671CEF20C3) Event Xml: <Event xmlns="http://schemas.microsoft.com/win/2004/08/events/event">.

Oct 03, 2022 · ninja: error: loading 'build.ninja': The system cannot find the file specified. Build complete (0 errors, 0 warnings): C:\Espressif\frameworks\esp-idf-v5.0\workspace\blink\build Total time taken to build the project: 12,018 ms I would appreciate any help! Thanks, Steve ESP_kumekay Posts: 5 Joined: Thu Nov 03, 2016 3:43 pm. > Executing task: ninja < ninja: error: loading 'build.ninja': The system cannot find the file specified. The terminal process "C:\WINDOWS\System32\WindowsPowerShell\v1.0\powershell.exe -Command ninja " terminated with exit code: 1. I have tested all the ways I can find to fix it but I'm not sure anything I missed or not. class="algoSlug_icon" data-priority="2">Web. Mar 14, 2019 · My name is Lee; an Independent Consultant, I'm here to help you with your problem. Open an elevated command prompt (search, cmd, right click and 'Run as administrator') Go to cd C:\Windows\System32\Recovery\ Rename the file ReAgent.xml: ren ReAgent.xml ReAgent.old Start Bitlocker Thanks ______________________________________________. Sep 24, 2021 · To do this, open the command line by right-clicking on Start and selecting Command Prompt (as administrator). In Command Prompt, type the following command: “sfc /scannow”. Now press Enter. After scanning and correcting errors, restart the computer and check if the “system cannot find the file specifiederror is fixed. Method 4.. CreateProcess failed: The system cannot find the file specified. ninja: FATAL: ReadFile: The handle is invalid. I briefly gone through the source code of gyp-win-tool, but have no idea. I sometimes see the following error: "ninja: error: loading 'build.ninja': The system cannot find the file specified." I do: build.cmd clr.runtime.

-- Project version: 1 -- Building ESP-IDF components for target esp32 -- Checking Python dependencies... CMake Error at C:/esp/esp-idf/tools/cmake/build.cmake:252 (message): Some Python dependencies must be installed. Check above message for details. Call Stack (most recent call first):.

Aug 29, 2018 · Building on Mac only works without headless.gn. The reason for that is that the headless windowing system (ozone's headless platform in particular) that we use on Linux/Win and is configured in headless.gn isn't yet supported on Mac..

kv

1 The ninja build system on your computer worked correctly! That error will occur if you run ninja with no arguments. If you add some arguments for it, such as ninja --version and then, It worked! Share Improve this answer Follow answered Mar 27 at 9:50 FlopffyGrape 54 5 Add a comment 0.

Opt out or xa anytime. See our eo.

Aug 29, 2018 · Building on Mac only works without headless.gn. The reason for that is that the headless windowing system (ozone's headless platform in particular) that we use on Linux/Win and is configured in headless.gn isn't yet supported on Mac.. Member List; Calendar; Mark channels read; Forum; V-Ray for 3ds Max; V-Ray for 3ds Max :: Issues; If this is your first visit, be sure to check out the FAQ by clicking the link above. You may have to register before you can post: click the register link above to proceed. To start viewing messages, select the forum that you want to visit from the selection below. class="algoSlug_icon" data-priority="2">Web. Aug 29, 2018 · environment :Mac Install ninja with the brew intsall ninja command then on terminal execute ninja occur ninja: error: loading &#39;build.ninja&#39;: No such file or directory 。 ~ ninja ninja: err....

de

  • ej

    xw

    Click on the Start menu and select Control Panel Click on Programs and Features Select Turn Windows features on or off Check the box next to Internet Explorer and click OK Launch Sage ACT! and test Internet Explorer Registry Keys Incorrect Close Sage ACT! Using Windows Explorer, search for iexplore.exe; note file path Default locations are:.

  • fq

    gj

    Mar 14, 2019 · My name is Lee; an Independent Consultant, I'm here to help you with your problem. Open an elevated command prompt (search, cmd, right click and 'Run as administrator') Go to cd C:\Windows\System32\Recovery\ Rename the file ReAgent.xml: ren ReAgent.xml ReAgent.old Start Bitlocker Thanks ______________________________________________. The account runersystem is local system user and member of Administrator and Power users groups. Windows 10 to accept File Paths Over 260 Characters enabled HKEY_LOCAL_MACHINE\SYSTEM\CurrentControlSet\Control\FileSystem - LongPathsEnabled - 1 Windows Update performed Antivirus Un-installed. Disk cleanup (Using Disk Cleanup) performed.

  • ve

    ln

    May 19, 2020 · Hello, That sounds like a technical issue. Please provide a support case ID for this issue, as requested when you click New Topic. Without case number, the topic will eventually be.

  • wy

    kz

    ntdll The system cannot find the file specified. You can troubleshoot most symbol related issues by turning on symbol loading diagnostics (!sym noisy) and repeating the command that caused symbols to be loaded. You should also verify that your symbol search path (.sympath) is correct. For analysis of this file, run !analyze -v.

oe
mm

class="algoSlug_icon" data-priority="2">Web. class="algoSlug_icon" data-priority="2">Web. 12-Feb-2013 21:08:42 sbvol 504 - cannot query incremental tracking state (-2 the system cannot find the specified file) This is likely a problem with corrupt registry settings from a previous installation of ShadowProtect that was not completely removed or another conflicting backup program is causing some interference.

Auto-suggest helps you quickly narrow down your search results by suggesting possible matches as you type. Sep 14, 2021 · NetApp provides no representations or warranties regarding the accuracy or reliability or serviceability of any information or recommendations provided in this publication or with respect to any results that may be obtained by the use of the information or observance of any recommendations provided herein..

ux
yf
>